Difference between revisions of "Win32 version of Scribus"

From Scribus Wiki
Jump to: navigation, search
Line 25: Line 25:
  
 
cboothe@IT-staff ~/src/scribus-1.2.1cvs
 
cboothe@IT-staff ~/src/scribus-1.2.1cvs
$ make -f Makefile.dist
+
$ make -f Makefile.dist
 
This Makefile is only for the CVS repository
 
This Makefile is only for the CVS repository
 
This will be deleted before making the distribution
 
This will be deleted before making the distribution
  
autoconf: not found
 
 
*** Creating acinclude.m4
 
*** Creating acinclude.m4
 
!!! If you get recursion errors from autoconf, it is advisable to set the
 
!!! If you get recursion errors from autoconf, it is advisable to set the
 
     environment variable M4 to something including "--nesting-limit=500"
 
     environment variable M4 to something including "--nesting-limit=500"
 
*** Creating aclocal.m4
 
*** Creating aclocal.m4
aclocal: not found
+
acinclude.m4:44: warning: underquoted definition of KDE_PATH_X_DIRECT
make[1]: *** [cvs] Error 127
+
  run info '(automake)Extending aclocal'
 +
  or see http://sources.redhat.com/automake/automake.html#Extending-aclocal
 +
acinclude.m4:168: warning: underquoted definition of AC_FIND_FILE
 +
...
 +
acinclude.m4:4681: warning: underquoted definition of AC_PATH_QTOPIA
 +
/usr/share/aclocal/freetype2.m4:7: warning: underquoted definition of AC_CHECK_FT2
 +
*** Creating configure
 +
*** Creating config.h template
 +
*** Creating Makefile templates
 +
configure.in:215: required file `scribus/templates/Makefile.in' not found
 +
make[1]: *** [cvs] Error 1
 
make: *** [all] Error 2
 
make: *** [all] Error 2
  

Revision as of 01:55, 8 March 2005

I've created this as a sort of scratch page for keeping track of the ongoing effort to compile Scribus 1.3 from CVS.

Please feel free to add and subtract as you feel so inclined to help!

Compiling from Scribus under Cygwin is a work in progress. As yet I haven't been successful. So far I have had gotten as far as a successful configure of the 1.3 version from CVS.

Here are some of my notes and other pastes for reference:




Legacy compiling instructions:

  • unpack scribus-1.2.1-src.tar.bz2
  • preconfigure:
  • make -f Makefile.dist
  • "CFLAGS="-fdata-sections" CXXFLAGS="-fdata-sections" LDFLAGS="-Wl, --enable-runtime-pseudo-reloc, --script, $(QTDIR)/mkspecs/cygwin-g++/i386pi.x-no-rdata" ./configure --prefix=/opt/scribus/1.2"
  • make CXXFLAGS="${CXXFLAGS} -I/usr/include/lcms"

My results from following these instructions:

cboothe@IT-staff ~/src
$ cd scribus-1.2.1cvs/

cboothe@IT-staff ~/src/scribus-1.2.1cvs
$  make -f Makefile.dist
This Makefile is only for the CVS repository
This will be deleted before making the distribution

*** Creating acinclude.m4
!!! If you get recursion errors from autoconf, it is advisable to set the
    environment variable M4 to something including "--nesting-limit=500"
*** Creating aclocal.m4
acinclude.m4:44: warning: underquoted definition of KDE_PATH_X_DIRECT
  run info '(automake)Extending aclocal'
  or see http://sources.redhat.com/automake/automake.html#Extending-aclocal
acinclude.m4:168: warning: underquoted definition of AC_FIND_FILE
...
acinclude.m4:4681: warning: underquoted definition of AC_PATH_QTOPIA
/usr/share/aclocal/freetype2.m4:7: warning: underquoted definition of AC_CHECK_FT2
*** Creating configure
*** Creating config.h template
*** Creating Makefile templates
configure.in:215: required file `scribus/templates/Makefile.in' not found
make[1]: *** [cvs] Error 1
make: *** [all] Error 2

cboothe@IT-staff ~/src/scribus-1.2.1cvs
$